FĂ©lix Delval (2) [Avatar] Offline
#1
After runing the install with:

mvn install -DskipTests


When I try to run the test with:

mvn test


I get this error:

?  game-service git:(master) mvn -Dtest=org.gamer.games.arquillian.ArquillianBasicTest test
[INFO] Scanning for projects...
[INFO] 
[INFO] ------------------------------------------------------------------------
[INFO] Building Game Service 1.0.0-SNAPSHOT
[INFO] ------------------------------------------------------------------------
[INFO] 
[INFO] --- maven-resources-plugin:2.6:resources (default-resources) @ game-service ---
[INFO] Using 'UTF-8' encoding to copy filtered resources.
[INFO] Copying 3 resources
[INFO] 
[INFO] --- maven-compiler-plugin:3.1:compile (default-compile) @ game-service ---
[INFO] Nothing to compile - all classes are up to date
[INFO] 
[INFO] --- maven-resources-plugin:2.6:testResources (default-testResources) @ game-service ---
[INFO] Using 'UTF-8' encoding to copy filtered resources.
[INFO] Copying 4 resources
[INFO] 
[INFO] --- maven-compiler-plugin:3.1:testCompile (default-testCompile) @ game-service ---
[INFO] Nothing to compile - all classes are up to date
[INFO] 
[INFO] --- maven-surefire-plugin:2.12.4:test (default-test) @ game-service ---
[INFO] Surefire report directory: /Users/fdelval/Projects/testing-java-microservice/game-service/target/surefire-reports

-------------------------------------------------------
 T E S T S
-------------------------------------------------------
Running org.gamer.games.arquillian.ArquillianBasicTest
Dependencies not bundled, will resolve from local M2REPO
09:47:51,742 INFO  [org.jboss.msc] (main) JBoss MSC version 1.2.6.Final
09:47:51,917 INFO  [org.jboss.as] (MSC service thread 1-6) WFLYSRV0049: WildFly Core 2.0.10.Final "Kenny" starting
2017-06-05 09:47:52,739 WARN  [org.jboss.as.txn] (ServerService Thread Pool -- 29) WFLYTX0013: Node identifier property is set to the default value. Please make sure it is unique.
2017-06-05 09:47:52,767 INFO  [org.wildfly.extension.io] (ServerService Thread Pool -- 22) WFLYIO001: Worker 'default' has auto-configured to 8 core threads with 64 task threads based on your 4 available processors
2017-06-05 09:47:52,784 INFO  [org.jboss.as.naming] (ServerService Thread Pool -- 26) WFLYNAM0001: Activating Naming Subsystem
2017-06-05 09:47:52,798 INFO  [org.jboss.as.security] (ServerService Thread Pool -- 28) WFLYSEC0002: Activating Security Subsystem
2017-06-05 09:47:52,803 INFO  [org.jboss.as.connector.subsystems.datasources] (ServerService Thread Pool -- 19) WFLYJCA0004: Deploying JDBC-compliant driver class org.h2.Driver (version 1.4)
2017-06-05 09:47:52,808 INFO  [org.jboss.as.security] (MSC service thread 1-5) WFLYSEC0001: Current PicketBox version=4.9.4.Final
2017-06-05 09:47:52,820 INFO  [org.wildfly.extension.undertow] (ServerService Thread Pool -- 30) WFLYUT0003: Undertow 1.3.15.Final starting
2017-06-05 09:47:52,820 INFO  [org.wildfly.extension.undertow] (MSC service thread 1-2) WFLYUT0003: Undertow 1.3.15.Final starting
2017-06-05 09:47:52,830 INFO  [org.jboss.as.connector] (MSC service thread 1-4) WFLYJCA0009: Starting JCA Subsystem (WildFly/IronJacamar 1.3.2.Final)
2017-06-05 09:47:52,856 INFO  [org.jboss.as.connector.deployers.jdbc] (MSC service thread 1-4) WFLYJCA0018: Started Driver service with driver-name = h2
2017-06-05 09:47:52,901 INFO  [org.jboss.as.naming] (MSC service thread 1-2) WFLYNAM0003: Starting Naming Service
2017-06-05 09:47:53,108 INFO  [org.xnio] (MSC service thread 1-5) XNIO version 3.3.4.Final
2017-06-05 09:47:53,126 INFO  [org.xnio.nio] (MSC service thread 1-5) XNIO NIO Implementation Version 3.3.4.Final
2017-06-05 09:47:53,215 INFO  [org.wildfly.extension.undertow] (MSC service thread 1-8) WFLYUT0012: Started server default-server.
2017-06-05 09:47:53,367 INFO  [org.jboss.as.connector.subsystems.datasources] (MSC service thread 1-6) WFLYJCA0001: Bound data source [java:jboss/datasources/ExampleDS]
2017-06-05 09:47:53,439 INFO  [org.jboss.as] (Controller Boot Thread) WFLYSRV0025: WildFly Core 2.0.10.Final "Kenny" started in 1758ms - Started 136 of 151 services (27 services are lazy, passive or on-demand)
2017-06-05 09:47:53,519 INFO  [org.wildfly.extension.undertow] (MSC service thread 1-6) WFLYUT0006: Undertow HTTP listener default listening on 0.0.0.0:8080
2017-06-05 09:47:53,760 INFO  [org.wildfly.swarm.runtime.deployer] (main) deploying org.gamer.games.arquillian.ArquillianBasicTest.war
2017-06-05 09:47:53,788 INFO  [org.jboss.as.server.deployment] (MSC service thread 1-7) WFLYSRV0027: Starting deployment of "org.gamer.games.arquillian.ArquillianBasicTest.war" (runtime-name: "org.gamer.games.arquillian.ArquillianBasicTest.war")
2017-06-05 09:47:54,382 INFO  [org.jboss.as.jpa] (MSC service thread 1-6) WFLYJPA0002: Read persistence.xml for gamesPU
2017-06-05 09:47:54,474 WARN  [org.jboss.as.dependency.private] (MSC service thread 1-4) WFLYSRV0018: Deployment "deployment.org.gamer.games.arquillian.ArquillianBasicTest.war" is using a private module ("org.jboss.jts:main") which may be changed or removed in future versions without notice.
2017-06-05 09:47:54,519 INFO  [org.jboss.as.jpa] (ServerService Thread Pool -- 9) WFLYJPA0010: Starting Persistence Unit (phase 1 of 2) Service 'org.gamer.games.arquillian.ArquillianBasicTest.war#gamesPU'
2017-06-05 09:47:54,568 INFO  [org.hibernate.jpa.internal.util.LogHelper] (ServerService Thread Pool -- 9) HHH000204: Processing PersistenceUnitInfo [
	name: gamesPU
	...]
2017-06-05 09:47:54,603 INFO  [org.jboss.weld.deployer] (MSC service thread 1-4) WFLYWELD0003: Processing weld deployment org.gamer.games.arquillian.ArquillianBasicTest.war
2017-06-05 09:47:54,709 INFO  [org.hibernate.Version] (ServerService Thread Pool -- 9) HHH000412: Hibernate Core {5.0.7.Final}
2017-06-05 09:47:54,712 INFO  [org.hibernate.cfg.Environment] (ServerService Thread Pool -- 9) HHH000206: hibernate.properties not found
2017-06-05 09:47:54,714 INFO  [org.hibernate.cfg.Environment] (ServerService Thread Pool -- 9) HHH000021: Bytecode provider name : javassist
2017-06-05 09:47:54,760 INFO  [org.hibernate.orm.deprecation] (ServerService Thread Pool -- 9) HHH90000001: Found usage of deprecated setting for specifying Scanner [hibernate.ejb.resource_scanner]; use [hibernate.archive.scanner] instead
2017-06-05 09:47:54,797 INFO  [org.hibernate.annotations.common.Version] (ServerService Thread Pool -- 9) HCANN000001: Hibernate Commons Annotations {5.0.1.Final}
2017-06-05 09:47:55,002 INFO  [org.hibernate.validator.internal.util.Version] (MSC service thread 1-4) HV000001: Hibernate Validator 5.2.3.Final
2017-06-05 09:47:55,082 INFO  [org.jboss.as.ejb3.deployment] (MSC service thread 1-4) WFLYEJB0473: JNDI bindings for session bean named 'Games' in deployment unit 'deployment "org.gamer.games.arquillian.ArquillianBasicTest.war"' are as follows:

	java:global/org.gamer.games.arquillian.ArquillianBasicTest/Games!org.gamer.games.boundary.Games
	java:app/org.gamer.games.arquillian.ArquillianBasicTest/Games!org.gamer.games.boundary.Games
	java:module/Games!org.gamer.games.boundary.Games
	java:global/org.gamer.games.arquillian.ArquillianBasicTest/Games
	java:app/org.gamer.games.arquillian.ArquillianBasicTest/Games
	java:module/Games

2017-06-05 09:47:55,083 INFO  [org.jboss.as.ejb3.deployment] (MSC service thread 1-4) WFLYEJB0473: JNDI bindings for session bean named 'IgdbGateway' in deployment unit 'deployment "org.gamer.games.arquillian.ArquillianBasicTest.war"' are as follows:

	java:global/org.gamer.games.arquillian.ArquillianBasicTest/IgdbGateway!org.gamer.games.boundary.IgdbGateway
	java:app/org.gamer.games.arquillian.ArquillianBasicTest/IgdbGateway!org.gamer.games.boundary.IgdbGateway
	java:module/IgdbGateway!org.gamer.games.boundary.IgdbGateway
	java:global/org.gamer.games.arquillian.ArquillianBasicTest/IgdbGateway
	java:app/org.gamer.games.arquillian.ArquillianBasicTest/IgdbGateway
	java:module/IgdbGateway

2017-06-05 09:47:55,333 INFO  [org.jboss.weld.deployer] (MSC service thread 1-3) WFLYWELD0006: Starting Services for CDI deployment: org.gamer.games.arquillian.ArquillianBasicTest.war
2017-06-05 09:47:55,374 INFO  [org.jboss.weld.Version] (MSC service thread 1-3) WELD-000900: 2.3.2 (Final)
2017-06-05 09:47:55,402 INFO  [org.wildfly.extension.undertow] (MSC service thread 1-7) WFLYUT0018: Host default-host starting
2017-06-05 09:47:55,459 INFO  [org.jboss.weld.deployer] (MSC service thread 1-8) WFLYWELD0009: Starting weld service for deployment org.gamer.games.arquillian.ArquillianBasicTest.war
2017-06-05 09:47:55,947 INFO  [org.wildfly.swarm.arquillian.daemon.server.Server] (MSC service thread 1-3) Arquillian Daemon server started on localhost:12345
2017-06-05 09:47:55,975 INFO  [org.jboss.as.jpa] (ServerService Thread Pool -- 9) WFLYJPA0010: Starting Persistence Unit (phase 2 of 2) Service 'org.gamer.games.arquillian.ArquillianBasicTest.war#gamesPU'
2017-06-05 09:47:56,240 INFO  [org.hibernate.dialect.Dialect] (ServerService Thread Pool -- 9) HHH000400: Using dialect: org.hibernate.dialect.H2Dialect
2017-06-05 09:47:56,246 WARN  [org.hibernate.dialect.H2Dialect] (ServerService Thread Pool -- 9) HHH000431: Unable to determine H2 database version, certain features may not work
2017-06-05 09:47:56,331 INFO  [org.hibernate.envers.boot.internal.EnversServiceImpl] (ServerService Thread Pool -- 9) Envers integration enabled? : true
2017-06-05 09:47:56,924 INFO  [org.hibernate.dialect.Dialect] (ServerService Thread Pool -- 9) HHH000400: Using dialect: org.hibernate.dialect.H2Dialect
2017-06-05 09:47:56,924 WARN  [org.hibernate.dialect.H2Dialect] (ServerService Thread Pool -- 9) HHH000431: Unable to determine H2 database version, certain features may not work
2017-06-05 09:47:57,754 INFO  [org.jboss.resteasy.resteasy_jaxrs.i18n] (ServerService Thread Pool -- 12) RESTEASY002225: Deploying javax.ws.rs.core.Application: class org.wildfly.swarm.generated.WildFlySwarmDefaultJAXRSApplication$Proxy$_$$_WeldClientProxy
2017-06-05 09:47:57,763 INFO  [org.wildfly.extension.undertow] (ServerService Thread Pool -- 12) WFLYUT0021: Registered web context: /
2017-06-05 09:47:57,774 INFO  [org.jboss.as.server] (main) WFLYSRV0010: Deployed "org.gamer.games.arquillian.ArquillianBasicTest.war" (runtime-name : "org.gamer.games.arquillian.ArquillianBasicTest.war")
Tests run: 1, Failures: 0, Errors: 1, Skipped: 0, Time elapsed: 24.338 sec <<< FAILURE!
test(org.gamer.games.arquillian.ArquillianBasicTest)  Time elapsed: 0.22 sec  <<< ERROR!
java.lang.RuntimeException: Could not create new instance of class org.jboss.arquillian.test.impl.EventTestRunnerAdaptor
	at org.jboss.arquillian.test.spi.SecurityActions.newInstance(SecurityActions.java:165)
	at org.jboss.arquillian.test.spi.SecurityActions.newInstance(SecurityActions.java:102)
	at org.jboss.arquillian.test.spi.TestRunnerAdaptorBuilder.build(TestRunnerAdaptorBuilder.java:52)
	at org.jboss.arquillian.junit.Arquillian.run(Arquillian.java:114)
	at org.junit.runner.JUnitCore.run(JUnitCore.java:137)
	at org.junit.runner.JUnitCore.run(JUnitCore.java:115)
	at org.jboss.arquillian.junit.container.JUnitTestRunner.execute(JUnitTestRunner.java:66)
	at sun.reflect.NativeMethodAccessorImpl.invoke0(Native Method)
	at sun.reflect.NativeMethodAccessorImpl.invoke(NativeMethodAccessorImpl.java:62)
	at sun.reflect.DelegatingMethodAccessorImpl.invoke(DelegatingMethodAccessorImpl.java:43)
	at java.lang.reflect.Method.invoke(Method.java:498)
	at org.wildfly.swarm.arquillian.daemon.TestRunner.executeTest(TestRunner.java:64)
	at org.wildfly.swarm.arquillian.daemon.server.Server.executeTest(Server.java:241)
	at org.wildfly.swarm.arquillian.daemon.server.Server$StringCommandHandler.channelRead0(Server.java:341)
	at org.wildfly.swarm.arquillian.daemon.server.Server$StringCommandHandler.channelRead0(Server.java:290)
	at io.netty.channel.SimpleChannelInboundHandler.channelRead(SimpleChannelInboundHandler.java:105)
	at io.netty.channel.AbstractChannelHandlerContext.invokeChannelRead(AbstractChannelHandlerContext.java:308)
	at io.netty.channel.AbstractChannelHandlerContext.fireChannelRead(AbstractChannelHandlerContext.java:294)
	at io.netty.handler.codec.MessageToMessageDecoder.channelRead(MessageToMessageDecoder.java:103)
	at io.netty.channel.AbstractChannelHandlerContext.invokeChannelRead(AbstractChannelHandlerContext.java:308)
	at io.netty.channel.AbstractChannelHandlerContext.fireChannelRead(AbstractChannelHandlerContext.java:294)
	at io.netty.handler.codec.ByteToMessageDecoder.channelRead(ByteToMessageDecoder.java:265)
	at io.netty.channel.AbstractChannelHandlerContext.invokeChannelRead(AbstractChannelHandlerContext.java:308)
	at io.netty.channel.AbstractChannelHandlerContext.fireChannelRead(AbstractChannelHandlerContext.java:294)
	at io.netty.channel.DefaultChannelPipeline.fireChannelRead(DefaultChannelPipeline.java:846)
	at io.netty.channel.nio.AbstractNioByteChannel$NioByteUnsafe.read(AbstractNioByteChannel.java:131)
	at io.netty.channel.nio.NioEventLoop.processSelectedKey(NioEventLoop.java:511)
	at io.netty.channel.nio.NioEventLoop.processSelectedKeysOptimized(NioEventLoop.java:468)
	at io.netty.channel.nio.NioEventLoop.processSelectedKeys(NioEventLoop.java:382)
	at io.netty.channel.nio.NioEventLoop.run(NioEventLoop.java:354)
	at io.netty.util.concurrent.SingleThreadEventExecutor$2.run(SingleThreadEventExecutor.java:112)
	at io.netty.util.concurrent.DefaultThreadFactory$DefaultRunnableDecorator.run(DefaultThreadFactory.java:137)
	at java.lang.Thread.run(Thread.java:745)
Caused by: java.lang.reflect.InvocationTargetException
	at sun.reflect.NativeConstructorAccessorImpl.newInstance0(Native Method)
	at sun.reflect.NativeConstructorAccessorImpl.newInstance(NativeConstructorAccessorImpl.java:62)
	at sun.reflect.DelegatingConstructorAccessorImpl.newInstance(DelegatingConstructorAccessorImpl.java:45)
	at java.lang.reflect.Constructor.newInstance(Constructor.java:423)
	at org.jboss.arquillian.test.spi.SecurityActions.newInstance(SecurityActions.java:161)
	... 32 more
Caused by: java.lang.RuntimeException: Could not create new instance of class org.jboss.arquillian.core.impl.ManagerImpl
	at org.jboss.arquillian.core.spi.SecurityActions.newInstance(SecurityActions.java:165)
	at org.jboss.arquillian.core.spi.SecurityActions.newInstance(SecurityActions.java:102)
	at org.jboss.arquillian.core.spi.ManagerBuilder.create(ManagerBuilder.java:77)
	at org.jboss.arquillian.test.impl.EventTestRunnerAdaptor.<init>(EventTestRunnerAdaptor.java:62)
	... 37 more
Caused by: java.lang.reflect.InvocationTargetException
	at sun.reflect.NativeConstructorAccessorImpl.newInstance0(Native Method)
	at sun.reflect.NativeConstructorAccessorImpl.newInstance(NativeConstructorAccessorImpl.java:62)
	at sun.reflect.DelegatingConstructorAccessorImpl.newInstance(DelegatingConstructorAccessorImpl.java:45)
	at java.lang.reflect.Constructor.newInstance(Constructor.java:423)
	at org.jboss.arquillian.core.spi.SecurityActions.newInstance(SecurityActions.java:161)
	... 40 more
Caused by: java.lang.NoSuchMethodError: org.jboss.arquillian.core.spi.ExtensionLoader.loadVetoed()Ljava/util/Map;
	at org.jboss.arquillian.core.impl.loadable.LoadableExtensionLoader.load(LoadableExtensionLoader.java:72)
	at sun.reflect.NativeMethodAccessorImpl.invoke0(Native Method)
	at sun.reflect.NativeMethodAccessorImpl.invoke(NativeMethodAccessorImpl.java:62)
	at sun.reflect.DelegatingMethodAccessorImpl.invoke(DelegatingMethodAccessorImpl.java:43)
	at java.lang.reflect.Method.invoke(Method.java:498)
	at org.jboss.arquillian.core.impl.ObserverImpl.invoke(ObserverImpl.java:96)
	at org.jboss.arquillian.core.impl.EventContextImpl.invokeObservers(EventContextImpl.java:99)
	at org.jboss.arquillian.core.impl.EventContextImpl.proceed(EventContextImpl.java:81)
	at org.jboss.arquillian.core.impl.ManagerImpl.fire(ManagerImpl.java:145)
	at org.jboss.arquillian.core.impl.ManagerImpl.fire(ManagerImpl.java:116)
	at org.jboss.arquillian.core.impl.ManagerImpl.fireProcessing(ManagerImpl.java:346)
	at org.jboss.arquillian.core.impl.ManagerImpl.<init>(ManagerImpl.java:100)
	... 45 more


Results :

Tests in error: 
  test(org.gamer.games.arquillian.ArquillianBasicTest): Could not create new instance of class org.jboss.arquillian.test.impl.EventTestRunnerAdaptor

Tests run: 1, Failures: 0, Errors: 1, Skipped: 0

[INFO] ------------------------------------------------------------------------
[INFO] BUILD FAILURE
[INFO] ------------------------------------------------------------------------
[INFO] Total time: 27.763 s
[INFO] Finished at: 2017-06-05T09:47:58+02:00
[INFO] Final Memory: 38M/449M
[INFO] ------------------------------------------------------------------------
[ERROR] Failed to execute goal org.apache.maven.plugins:maven-surefire-plugin:2.12.4:test (default-test) on project game-service: There are test failures.
[ERROR] 
[ERROR] Please refer to /Users/fdelval/Projects/testing-java-microservice/game-service/target/surefire-reports for the individual test results.
[ERROR] -> [Help 1]
[ERROR] 
[ERROR] To see the full stack trace of the errors, re-run Maven with the -e switch.
[ERROR] Re-run Maven using the -X switch to enable full debug logging.
[ERROR] 
[ERROR] For more information about the errors and possible solutions, please read the following articles:
[ERROR] [Help 1] http://cwiki.apache.org/confluence/display/MAVEN/MojoFailureException


I'm a bit stuck with this as I have a very limited java experience.

I checked google and found out that this might be that not all dependencies are using the same version of arquilian, according to dependencies tree this is not the case.

?  game-service git:(master) mvn dependency:tree 
[INFO] Scanning for projects...
[INFO] 
[INFO] ------------------------------------------------------------------------
[INFO] Building Game Service 1.0.0-SNAPSHOT
[INFO] ------------------------------------------------------------------------
[INFO] 
[INFO] --- maven-dependency-plugin:2.8:tree (default-cli) @ game-service ---
[INFO] org.gamer:game-service:war:1.0.0-SNAPSHOT
[INFO] +- javax:javaee-api:jar:7.0:provided
[INFO] |  \- com.sun.mail:javax.mail:jar:1.5.0:provided
[INFO] |     \- javax.activation:activation:jar:1.1:provided
[INFO] +- org.wildfly.swarm:ejb:jar:1.0.2.Final:compile
[INFO] |  +- org.wildfly.swarm:container:jar:1.0.2.Final:compile
[INFO] |  |  +- org.wildfly.swarm:container-api:jar:1.0.2.Final:compile
[INFO] |  |  |  +- org.wildfly.swarm:config-api-modules:jar:0.4.4:compile
[INFO] |  |  |  \- org.yaml:snakeyaml:jar:1.17:compile
[INFO] |  |  \- org.wildfly.swarm:container-modules:jar:1.0.2.Final:compile
[INFO] |  +- org.wildfly.swarm:ejb-api:jar:1.0.2.Final:compile
[INFO] |  |  +- org.wildfly.swarm:config-api:jar:0.4.4:compile
[INFO] |  |  |  \- org.wildfly.swarm:config-api-runtime:jar:0.4.4:compile
[INFO] |  |  +- org.wildfly.swarm:security-api:jar:1.0.2.Final:compile
[INFO] |  |  +- org.jboss.spec.javax.ejb:jboss-ejb-api_3.2_spec:jar:1.0.0.Final:compile
[INFO] |  |  \- org.jboss.ejb3:jboss-ejb3-ext-api:jar:2.2.0.Final:compile
[INFO] |  +- org.wildfly.swarm:ejb-modules:jar:1.0.2.Final:compile
[INFO] |  |  +- org.wildfly.swarm:bootstrap:jar:1.0.2.Final:compile
[INFO] |  |  |  \- org.jboss.spec.javax.sql:jboss-javax-sql-api_7.0_spec:jar:2.0.0.Final:compile
[INFO] |  |  +- org.wildfly.swarm:jca-modules:jar:1.0.2.Final:compile
[INFO] |  |  |  +- org.wildfly.swarm:connector-modules:jar:1.0.2.Final:compile
[INFO] |  |  |  |  \- org.wildfly.swarm:jgroups-modules:jar:1.0.2.Final:compile
[INFO] |  |  |  |     \- org.wildfly.swarm:jmx-modules:jar:1.0.2.Final:compile
[INFO] |  |  |  \- org.wildfly.swarm:transactions-modules:jar:1.0.2.Final:compile
[INFO] |  |  +- org.wildfly.swarm:ee-modules:jar:1.0.2.Final:compile
[INFO] |  |  \- org.wildfly.swarm:security-modules:jar:1.0.2.Final:compile
[INFO] |  +- org.wildfly.swarm:ee:jar:1.0.2.Final:compile
[INFO] |  |  +- org.wildfly.swarm:ee-api:jar:1.0.2.Final:compile
[INFO] |  |  |  +- org.jboss.spec.javax.enterprise.concurrent:jboss-concurrency-api_1.0_spec:jar:1.0.0.Final:compile
[INFO] |  |  |  \- org.jboss.spec.javax.interceptor:jboss-interceptors-api_1.2_spec:jar:1.0.0.Final:compile
[INFO] |  |  \- org.wildfly.swarm:naming:jar:1.0.2.Final:compile
[INFO] |  |     +- org.wildfly.swarm:naming-api:jar:1.0.2.Final:compile
[INFO] |  |     \- org.wildfly.swarm:naming-modules:jar:1.0.2.Final:compile
[INFO] |  +- org.wildfly.swarm:jca:jar:1.0.2.Final:compile
[INFO] |  |  \- org.wildfly.swarm:jca-api:jar:1.0.2.Final:compile
[INFO] |  |     \- org.wildfly.swarm:connector:jar:1.0.2.Final:compile
[INFO] |  |        \- org.wildfly.swarm:connector-api:jar:1.0.2.Final:compile
[INFO] |  |           \- org.jboss.spec.javax.resource:jboss-connector-api_1.7_spec:jar:1.0.0.Final:compile
[INFO] |  \- org.wildfly.swarm:security:jar:1.0.2.Final:compile
[INFO] +- org.wildfly.swarm:jaxrs-cdi:jar:1.0.2.Final:compile
[INFO] |  +- org.wildfly.swarm:jaxrs:jar:1.0.2.Final:compile
[INFO] |  |  +- org.wildfly.swarm:jaxrs-api:jar:1.0.2.Final:compile
[INFO] |  |  |  +- org.wildfly.swarm:undertow-api:jar:1.0.2.Final:compile
[INFO] |  |  |  |  +- org.jboss.spec.javax.servlet:jboss-servlet-api_3.1_spec:jar:1.0.0.Final:compile
[INFO] |  |  |  |  +- org.jboss.spec.javax.websocket:jboss-websocket-api_1.1_spec:jar:1.1.1.Final:compile
[INFO] |  |  |  |  \- io.undertow:undertow-servlet:jar:1.3.15.Final:compile
[INFO] |  |  |  \- com.fasterxml.jackson.jaxrs:jackson-jaxrs-json-provider:jar:2.5.4:compile
[INFO] |  |  |     +- com.fasterxml.jackson.jaxrs:jackson-jaxrs-base:jar:2.5.4:compile
[INFO] |  |  |     \- com.fasterxml.jackson.module:jackson-module-jaxb-annotations:jar:2.5.4:compile
[INFO] |  |  +- org.wildfly.swarm:jaxrs-modules:jar:1.0.2.Final:compile
[INFO] |  |  |  \- org.wildfly.swarm:undertow-modules:jar:1.0.2.Final:compile
[INFO] |  |  |     \- org.wildfly.swarm:io-modules:jar:1.0.2.Final:compile
[INFO] |  |  \- org.wildfly.swarm:undertow:jar:1.0.2.Final:compile
[INFO] |  |     +- org.wildfly.swarm:io:jar:1.0.2.Final:compile
[INFO] |  |     |  \- org.wildfly.swarm:io-api:jar:1.0.2.Final:compile
[INFO] |  |     \- org.wildfly.swarm:request-controller:jar:1.0.2.Final:compile
[INFO] |  |        +- org.wildfly.swarm:request-controller-api:jar:1.0.2.Final:compile
[INFO] |  |        \- org.wildfly.swarm:request-controller-modules:jar:1.0.2.Final:compile
[INFO] |  \- org.wildfly.swarm:cdi:jar:1.0.2.Final:compile
[INFO] |     +- org.wildfly.swarm:cdi-api:jar:1.0.2.Final:compile
[INFO] |     |  +- javax.enterprise:cdi-api:jar:1.2:compile
[INFO] |     |  \- javax.inject:javax.inject:jar:1:compile
[INFO] |     +- org.wildfly.swarm:cdi-modules:jar:1.0.2.Final:compile
[INFO] |     |  +- org.wildfly.swarm:bean-validation-modules:jar:1.0.2.Final:compile
[INFO] |     |  +- org.wildfly.swarm:cdi-ext:jar:1.0.2.Final:compile
[INFO] |     |  \- javax.annotation:jsr250-api:jar:1.0:compile
[INFO] |     +- org.wildfly.swarm:bean-validation:jar:1.0.2.Final:compile
[INFO] |     |  \- org.wildfly.swarm:bean-validation-api:jar:1.0.2.Final:compile
[INFO] |     +- org.wildfly.swarm:logging:jar:1.0.2.Final:compile
[INFO] |     |  +- org.wildfly.swarm:logging-api:jar:1.0.2.Final:compile
[INFO] |     |  |  \- org.slf4j:jcl-over-slf4j:jar:1.7.7.jbossorg-1:compile
[INFO] |     |  \- org.wildfly.swarm:logging-modules:jar:1.0.2.Final:compile
[INFO] |     \- org.wildfly.swarm:transactions:jar:1.0.2.Final:compile
[INFO] |        \- org.wildfly.swarm:transactions-api:jar:1.0.2.Final:compile
[INFO] |           +- org.jboss.spec.javax.transaction:jboss-transaction-api_1.2_spec:jar:1.0.0.Final:compile
[INFO] |           \- org.jboss.narayana.jts:narayana-jts-idlj:jar:5.2.12.Final:compile
[INFO] |              \- org.jboss.openjdk-orb:openjdk-orb:jar:8.0.4.Final:compile
[INFO] +- org.wildfly.swarm:jaxrs-jsonp:jar:1.0.2.Final:compile
[INFO] |  \- org.glassfish:javax.json:jar:1.0.3:compile
[INFO] +- org.wildfly.swarm:jaxrs-validator:jar:1.0.2.Final:compile
[INFO] |  +- org.wildfly.swarm:hibernate-validator:jar:1.0.2.Final:compile
[INFO] |  |  +- org.hibernate:hibernate-validator:jar:5.2.3.Final:compile
[INFO] |  |  |  \- javax.validation:validation-api:jar:1.1.0.Final:compile
[INFO] |  |  +- org.jboss.spec.javax.el:jboss-el-api_3.0_spec:jar:1.0.5.Final:compile
[INFO] |  |  \- org.glassfish:javax.el-impl:jar:3.0.1-b08-jbossorg-1:compile
[INFO] |  \- org.jboss.resteasy:resteasy-validator-provider-11:jar:3.0.14.Final:compile
[INFO] |     \- com.fasterxml:classmate:jar:0.8.0:compile
[INFO] +- org.wildfly.swarm:jpa:jar:1.0.2.Final:compile
[INFO] |  +- org.wildfly.swarm:jpa-api:jar:1.0.2.Final:compile
[INFO] |  |  +- org.wildfly.swarm:datasources-api:jar:1.0.2.Final:compile
[INFO] |  |  \- org.hibernate.javax.persistence:hibernate-jpa-2.1-api:jar:1.0.0.Final:compile
[INFO] |  +- org.wildfly.swarm:jpa-modules:jar:1.0.2.Final:compile
[INFO] |  |  \- org.wildfly.swarm:datasources-modules:jar:1.0.2.Final:compile
[INFO] |  \- org.wildfly.swarm:datasources:jar:1.0.2.Final:compile
[INFO] +- com.h2database:h2:jar:1.4.187:compile
[INFO] +- org.jboss.arquillian.junit:arquillian-junit-container:jar:1.1.12.Final:test
[INFO] |  +- org.jboss.arquillian.junit:arquillian-junit-core:jar:1.1.12.Final:test
[INFO] |  +- org.jboss.arquillian.test:arquillian-test-api:jar:1.1.12.Final:test
[INFO] |  |  \- org.jboss.arquillian.core:arquillian-core-api:jar:1.1.12.Final:test
[INFO] |  +- org.jboss.arquillian.test:arquillian-test-spi:jar:1.1.12.Final:test
[INFO] |  |  \- org.jboss.arquillian.core:arquillian-core-spi:jar:1.1.12.Final:test
[INFO] |  +- org.jboss.arquillian.container:arquillian-container-test-api:jar:1.1.12.Final:test
[INFO] |  |  \- org.jboss.shrinkwrap:shrinkwrap-api:jar:1.2.6:compile
[INFO] |  +- org.jboss.arquillian.container:arquillian-container-test-spi:jar:1.1.12.Final:test
[INFO] |  +- org.jboss.arquillian.core:arquillian-core-impl-base:jar:1.1.12.Final:test
[INFO] |  +- org.jboss.arquillian.test:arquillian-test-impl-base:jar:1.1.12.Final:test
[INFO] |  +- org.jboss.arquillian.container:arquillian-container-impl-base:jar:1.1.12.Final:test
[INFO] |  |  +- org.jboss.arquillian.config:arquillian-config-api:jar:1.1.12.Final:test
[INFO] |  |  \- org.jboss.shrinkwrap.descriptors:shrinkwrap-descriptors-spi:jar:2.0.0-alpha-9:compile
[INFO] |  +- org.jboss.arquillian.container:arquillian-container-test-impl-base:jar:1.1.12.Final:test
[INFO] |  \- org.jboss.shrinkwrap:shrinkwrap-impl-base:jar:1.2.6:compile
[INFO] |     \- org.jboss.shrinkwrap:shrinkwrap-spi:jar:1.2.6:compile
[INFO] +- org.wildfly.swarm:arquillian:jar:1.0.2.Final:test
[INFO] |  +- org.wildfly.swarm:arquillian-resolver:jar:1.0.2.Final:test
[INFO] |  |  \- org.jboss.shrinkwrap.resolver:shrinkwrap-resolver-impl-maven:jar:2.2.4:test
[INFO] |  |     +- org.jboss.shrinkwrap.resolver:shrinkwrap-resolver-api-maven:jar:2.2.4:test
[INFO] |  |     |  \- org.jboss.shrinkwrap.resolver:shrinkwrap-resolver-api:jar:2.2.4:test
[INFO] |  |     +- org.jboss.shrinkwrap.resolver:shrinkwrap-resolver-spi-maven:jar:2.2.4:test
[INFO] |  |     |  \- org.jboss.shrinkwrap.resolver:shrinkwrap-resolver-spi:jar:2.2.4:test
[INFO] |  |     +- org.eclipse.aether:aether-api:jar:1.0.0.v20140518:test
[INFO] |  |     +- org.eclipse.aether:aether-impl:jar:1.0.0.v20140518:test
[INFO] |  |     +- org.eclipse.aether:aether-spi:jar:1.0.0.v20140518:test
[INFO] |  |     +- org.eclipse.aether:aether-util:jar:1.0.0.v20140518:test
[INFO] |  |     +- org.eclipse.aether:aether-connector-basic:jar:1.0.0.v20140518:test
[INFO] |  |     +- org.eclipse.aether:aether-transport-wagon:jar:1.0.0.v20140518:test
[INFO] |  |     +- org.apache.maven:maven-aether-provider:jar:3.2.5:test
[INFO] |  |     +- org.apache.maven:maven-model:jar:3.2.5:test
[INFO] |  |     +- org.apache.maven:maven-model-builder:jar:3.2.5:test
[INFO] |  |     |  \- org.codehaus.plexus:plexus-component-annotations:jar:1.5.5:test
[INFO] |  |     +- org.apache.maven:maven-repository-metadata:jar:3.2.5:test
[INFO] |  |     +- org.apache.maven:maven-settings:jar:3.2.5:test
[INFO] |  |     +- org.apache.maven:maven-settings-builder:jar:3.2.5:test
[INFO] |  |     +- org.codehaus.plexus:plexus-interpolation:jar:1.21:test
[INFO] |  |     +- org.codehaus.plexus:plexus-utils:jar:3.0.20:test
[INFO] |  |     +- org.sonatype.plexus:plexus-sec-dispatcher:jar:1.3:test
[INFO] |  |     |  \- org.sonatype.plexus:plexus-cipher:jar:1.4:test
[INFO] |  |     +- org.apache.maven.wagon:wagon-provider-api:jar:2.6:test
[INFO] |  |     +- org.apache.maven.wagon:wagon-file:jar:2.6:test
[INFO] |  |     |  \- commons-lang:commons-lang:jar:2.6:test
[INFO] |  |     \- org.apache.maven.wagon:wagon-http-lightweight:jar:2.6:test
[INFO] |  |        \- org.apache.maven.wagon:wagon-http-shared:jar:2.6:test
[INFO] |  |           \- org.jsoup:jsoup:jar:1.7.2:test
[INFO] |  +- org.wildfly.swarm:spi-api:jar:1.0.5.Final:compile
[INFO] |  |  +- org.jboss.shrinkwrap.descriptors:shrinkwrap-descriptors-api-jboss:jar:2.0.0-alpha-9:compile
[INFO] |  |  |  \- org.jboss.shrinkwrap.descriptors:shrinkwrap-descriptors-api-javaee:jar:2.0.0-alpha-9:compile
[INFO] |  |  \- org.jboss.shrinkwrap.descriptors:shrinkwrap-descriptors-impl-jboss:jar:2.0.0-alpha-9:compile
[INFO] |  |     \- org.jboss.shrinkwrap.descriptors:shrinkwrap-descriptors-impl-javaee:jar:2.0.0-alpha-9:compile
[INFO] |  |        \- org.jboss.shrinkwrap.descriptors:shrinkwrap-descriptors-impl-base:jar:2.0.0-alpha-9:compile
[INFO] |  +- org.wildfly.swarm:tools:jar:1.0.2.Final:test
[INFO] |  |  \- org.ow2.asm:asm-all:jar:5.0.4:compile
[INFO] |  +- org.wildfly.swarm:msc:jar:1.0.2.Final:test
[INFO] |  |  +- org.wildfly.swarm:msc-api:jar:1.0.2.Final:test
[INFO] |  |  \- org.wildfly.swarm:msc-modules:jar:1.0.2.Final:test
[INFO] |  +- org.jboss.arquillian.container:arquillian-container-spi:jar:1.1.12.Final:test
[INFO] |  |  \- org.jboss.shrinkwrap.descriptors:shrinkwrap-descriptors-api-base:jar:2.0.0-alpha-9:compile
[INFO] |  +- org.wildfly.swarm:arquillian-daemon:jar:1.0.2.Final:test
[INFO] |  |  +- org.wildfly.core:wildfly-server:jar:2.0.10.Final:test
[INFO] |  |  |  +- org.wildfly.core:wildfly-controller:jar:2.0.10.Final:test
[INFO] |  |  |  |  +- org.wildfly.core:wildfly-controller-client:jar:2.0.10.Final:test
[INFO] |  |  |  |  +- org.wildfly.core:wildfly-core-security:jar:2.0.10.Final:test
[INFO] |  |  |  |  |  \- org.wildfly.core:wildfly-core-security-api:jar:2.0.10.Final:test
[INFO] |  |  |  |  \- org.jboss:staxmapper:jar:1.2.0.Final:test
[INFO] |  |  |  +- org.wildfly.core:wildfly-domain-http-interface:jar:2.0.10.Final:test
[INFO] |  |  |  |  \- org.wildfly.core:wildfly-domain-management:jar:2.0.10.Final:test
[INFO] |  |  |  |     \- org.picketbox:picketbox:jar:4.9.4.Final:test
[INFO] |  |  |  +- org.wildfly.core:wildfly-deployment-repository:jar:2.0.10.Final:test
[INFO] |  |  |  |  \- org.wildfly.core:wildfly-protocol:jar:2.0.10.Final:test
[INFO] |  |  |  +- org.wildfly.core:wildfly-platform-mbean:jar:2.0.10.Final:test
[INFO] |  |  |  +- org.wildfly.core:wildfly-process-controller:jar:2.0.10.Final:test
[INFO] |  |  |  +- org.wildfly.core:wildfly-remoting:jar:2.0.10.Final:test
[INFO] |  |  |  |  +- org.wildfly.core:wildfly-io:jar:2.0.10.Final:test
[INFO] |  |  |  |  \- org.jboss.xnio:xnio-api:jar:3.3.4.Final:compile
[INFO] |  |  |  +- org.wildfly.core:wildfly-network:jar:2.0.10.Final:test
[INFO] |  |  |  +- org.wildfly.core:wildfly-self-contained:jar:2.0.10.Final:test
[INFO] |  |  |  +- org.wildfly.security:wildfly-elytron:jar:1.0.2.Final:test
[INFO] |  |  |  +- org.wildfly.core:wildfly-version:jar:2.0.10.Final:test
[INFO] |  |  |  +- org.jboss:jandex:jar:2.0.1.Final:test
[INFO] |  |  |  +- org.jboss:jboss-dmr:jar:1.3.0.Final:test
[INFO] |  |  |  +- org.jboss.invocation:jboss-invocation:jar:1.4.1.Final:test
[INFO] |  |  |  +- org.jboss.logmanager:jboss-logmanager:jar:2.0.3.Final:test
[INFO] |  |  |  +- org.jboss.marshalling:jboss-marshalling:jar:1.4.10.Final:test
[INFO] |  |  |  +- org.jboss.modules:jboss-modules:jar:1.5.1.Final:test
[INFO] |  |  |  +- org.jboss.remoting:jboss-remoting:jar:4.0.18.Final:test
[INFO] |  |  |  +- org.jboss.sasl:jboss-sasl:jar:1.0.5.Final:test
[INFO] |  |  |  +- org.jboss.stdio:jboss-stdio:jar:1.0.2.GA:test
[INFO] |  |  |  +- org.jboss.threads:jboss-threads:jar:2.2.1.Final:test
[INFO] |  |  |  +- org.jboss:jboss-vfs:jar:3.2.11.Final:test
[INFO] |  |  |  +- io.undertow:undertow-core:jar:1.3.15.Final:compile
[INFO] |  |  |  |  \- org.jboss.xnio:xnio-nio:jar:3.3.4.Final:runtime
[INFO] |  |  |  \- org.wildfly.common:wildfly-common:jar:1.1.0.Final:test
[INFO] |  |  +- org.wildfly.swarm:arquillian-daemon-modules:jar:1.0.2.Final:test
[INFO] |  |  \- org.jboss.msc:jboss-msc:jar:1.2.6.Final:test
[INFO] |  +- org.jboss.arquillian.testenricher:arquillian-testenricher-cdi:jar:1.1.12.Final:test
[INFO] |  +- org.jboss.arquillian.testenricher:arquillian-testenricher-ejb:jar:1.1.12.Final:test
[INFO] |  +- org.jboss.arquillian.testenricher:arquillian-testenricher-resource:jar:1.1.12.Final:test
[INFO] |  +- org.jboss.arquillian.testenricher:arquillian-testenricher-initialcontext:jar:1.1.12.Final:test
[INFO] |  \- org.jboss.arquillian.config:arquillian-config-impl-base:jar:1.1.12.Final:test
[INFO] +- com.github.tomakehurst:wiremock:jar:2.2.1:test
[INFO] |  +- org.eclipse.jetty:jetty-server:jar:9.2.13.v20150730:test
[INFO] |  |  +- javax.servlet:javax.servlet-api:jar:3.1.0:test
[INFO] |  |  +- org.eclipse.jetty:jetty-http:jar:9.2.13.v20150730:test
[INFO] |  |  \- org.eclipse.jetty:jetty-io:jar:9.2.13.v20150730:test
[INFO] |  +- org.eclipse.jetty:jetty-servlet:jar:9.2.13.v20150730:test
[INFO] |  |  \- org.eclipse.jetty:jetty-security:jar:9.2.13.v20150730:test
[INFO] |  +- org.eclipse.jetty:jetty-servlets:jar:9.2.13.v20150730:test
[INFO] |  |  +- org.eclipse.jetty:jetty-continuation:jar:9.2.13.v20150730:test
[INFO] |  |  \- org.eclipse.jetty:jetty-util:jar:9.2.13.v20150730:test
[INFO] |  +- org.eclipse.jetty:jetty-webapp:jar:9.2.13.v20150730:test
[INFO] |  |  \- org.eclipse.jetty:jetty-xml:jar:9.2.13.v20150730:test
[INFO] |  +- com.google.guava:guava:jar:18.0:test
[INFO] |  +- com.fasterxml.jackson.core:jackson-core:jar:2.6.1:compile
[INFO] |  +- com.fasterxml.jackson.core:jackson-annotations:jar:2.6.1:compile
[INFO] |  +- com.fasterxml.jackson.core:jackson-databind:jar:2.6.1:compile
[INFO] |  +- org.apache.httpcomponents:httpclient:jar:4.5.1:test
[INFO] |  |  +- org.apache.httpcomponents:httpcore:jar:4.4.3:test
[INFO] |  |  +- commons-logging:commons-logging:jar:1.2:test
[INFO] |  |  \- commons-codec:commons-codec:jar:1.9:test
[INFO] |  +- org.xmlunit:xmlunit-core:jar:2.1.1:test
[INFO] |  +- org.xmlunit:xmlunit-legacy:jar:2.1.1:test
[INFO] |  +- com.jayway.jsonpath:json-path:jar:2.2.0:test
[INFO] |  |  \- net.minidev:json-smart:jar:2.2.1:test
[INFO] |  |     \- net.minidev:accessors-smart:jar:1.1:test
[INFO] |  |        \- org.ow2.asm:asm:jar:5.0.3:test
[INFO] |  +- org.slf4j:slf4j-api:jar:1.7.12:compile
[INFO] |  +- net.sf.jopt-simple:jopt-simple:jar:4.9:test
[INFO] |  +- org.apache.commons:commons-lang3:jar:3.4:test
[INFO] |  \- com.flipkart.zjsonpatch:zjsonpatch:jar:0.2.1:test
[INFO] |     \- org.apache.commons:commons-collections4:jar:4.0:test
[INFO] +- junit:junit:jar:4.12:test
[INFO] |  \- org.hamcrest:hamcrest-core:jar:1.3:test
[INFO] +- org.assertj:assertj-core:jar:3.5.2:test
[INFO] +- org.mockito:mockito-core:jar:1.10.19:test
[INFO] |  \- org.objenesis:objenesis:jar:2.1:test
[INFO] +- org.jboss.resteasy:resteasy-client:jar:3.0.21.Final:test
[INFO] |  \- org.jboss.resteasy:resteasy-jaxrs:jar:3.0.21.Final:test
[INFO] |     +- org.jboss.spec.javax.ws.rs:jboss-jaxrs-api_2.0_spec:jar:1.0.1.Beta1:compile
[INFO] |     +- org.jboss.spec.javax.annotation:jboss-annotations-api_1.2_spec:jar:1.0.0.Final:compile
[INFO] |     \- net.jcip:jcip-annotations:jar:1.0:test
[INFO] +- org.jboss.resteasy:resteasy-jackson-provider:jar:3.0.21.Final:test
[INFO] |  +- org.codehaus.jackson:jackson-core-asl:jar:1.9.13:test
[INFO] |  +- org.codehaus.jackson:jackson-mapper-asl:jar:1.9.13:test
[INFO] |  +- org.codehaus.jackson:jackson-jaxrs:jar:1.9.13:test
[INFO] |  \- org.codehaus.jackson:jackson-xc:jar:1.9.13:test
[INFO] +- org.jboss.logging:jboss-logging:jar:3.3.0.Final:compile
[INFO] +- commons-io:commons-io:jar:2.5:compile
[INFO] \- org.slf4j:slf4j-simple:jar:1.7.21:test
[INFO] ------------------------------------------------------------------------
[INFO] BUILD SUCCESS
[INFO] ------------------------------------------------------------------------
[INFO] Total time: 3.021 s
[INFO] Finished at: 2017-06-05T10:57:25+02:00
[INFO] Final Memory: 42M/437M
[INFO] ------------------------------------------------------------------------