markrbower (13) [Avatar] Offline
#1
I checked through the proceeding posts. Apologies if I missed it. Working on Mac OS X 10.5.8. Downloaded the code. Passed the ./setEnvironment.sh test. When I run ./install.sh, I get (after adding the -e option), I get:

mark-bowers-macbookpro41-435:AspectJInActionSecondEdition-sources-1.0.0 markbower$ ./install.sh
[INFO] Error stacktraces are turned on.
[INFO] Scanning for projects...
[INFO] ------------------------------------------------------------------------
[INFO] BUILD FAILURE
[INFO] ------------------------------------------------------------------------
[INFO] Total time: 1.293s
[INFO] Finished at: Sat Apr 28 22:39:04 CDT 2012
[INFO] Final Memory: 2M/81M
[INFO] ------------------------------------------------------------------------
[ERROR] The goal you specified requires a project to execute but there is no POM in this directory (/Users/markbower/Documents/src/AspectJInActionSecondEdition-sources-1.0.0). Please verify you invoked Maven from the correct directory. -> [Help 1]
org.apache.maven.lifecycle.MissingProjectException: The goal you specified requires a project to execute but there is no POM in this directory (/Users/markbower/Documents/src/AspectJInActionSecondEdition-sources-1.0.0). Please verify you invoked Maven from the correct directory.
at org.apache.maven.lifecycle.internal.LifecycleStarter.execute(LifecycleStarter.java:89)
at org.apache.maven.DefaultMaven.doExecute(DefaultMaven.java:319)
at org.apache.maven.DefaultMaven.execute(DefaultMaven.java:156)
at org.apache.maven.cli.MavenCli.execute(MavenCli.java:537)
at org.apache.maven.cli.MavenCli.doMain(MavenCli.java:196)
at org.apache.maven.cli.MavenCli.main(MavenCli.java:141)
at sun.reflect.NativeMethodAccessorImpl.invoke0(Native Method)
at sun.reflect.NativeMethodAccessorImpl.invoke(NativeMethodAccessorImpl.java:39)
at sun.reflect.DelegatingMethodAccessorImpl.invoke(DelegatingMethodAccessorImpl.java:25)
at java.lang.reflect.Method.invoke(Method.java:597)
at org.codehaus.plexus.classworlds.launcher.Launcher.launchEnhanced(Launcher.java:290)
at org.codehaus.plexus.classworlds.launcher.Launcher.launch(Launcher.java:230)
at org.codehaus.plexus.classworlds.launcher.Launcher.mainWithExitCode(Launcher.java:409)
at org.codehaus.plexus.classworlds.launcher.Launcher.main(Launcher.java:352)
[ERROR]
[ERROR] Re-run Maven using the -X switch to enable full debug logging.
[ERROR]
[ERROR] For more information about the errors and possible solutions, please read the following articles:
[ERROR] [Help 1] http://cwiki.apache.org/confluence/display/MAVEN/MissingProjectException
mark-bowers-macbookpro41-435:AspectJInActionSecondEdition-sources-1.0.0 markbower$ vi ./install.sh
mark-bowers-macbookpro41-435:AspectJInActionSecondEdition-sources-1.0.0 markbower$ ./install.sh
[INFO] Error stacktraces are turned on.
[INFO] Scanning for projects...
[INFO] ------------------------------------------------------------------------
[INFO] BUILD FAILURE
[INFO] ------------------------------------------------------------------------
[INFO] Total time: 0.160s
[INFO] Finished at: Sat Apr 28 22:39:35 CDT 2012
[INFO] Final Memory: 2M/81M
[INFO] ------------------------------------------------------------------------
[ERROR] The goal you specified requires a project to execute but there is no POM in this directory (/Users/markbower/Documents/src/AspectJInActionSecondEdition-sources-1.0.0). Please verify you invoked Maven from the correct directory. -> [Help 1]
org.apache.maven.lifecycle.MissingProjectException: The goal you specified requires a project to execute but there is no POM in this directory (/Users/markbower/Documents/src/AspectJInActionSecondEdition-sources-1.0.0). Please verify you invoked Maven from the correct directory.
at org.apache.maven.lifecycle.internal.LifecycleStarter.execute(LifecycleStarter.java:89)
at org.apache.maven.DefaultMaven.doExecute(DefaultMaven.java:319)
at org.apache.maven.DefaultMaven.execute(DefaultMaven.java:156)
at org.apache.maven.cli.MavenCli.execute(MavenCli.java:537)
at org.apache.maven.cli.MavenCli.doMain(MavenCli.java:196)
at org.apache.maven.cli.MavenCli.main(MavenCli.java:141)
at sun.reflect.NativeMethodAccessorImpl.invoke0(Native Method)
at sun.reflect.NativeMethodAccessorImpl.invoke(NativeMethodAccessorImpl.java:39)
at sun.reflect.DelegatingMethodAccessorImpl.invoke(DelegatingMethodAccessorImpl.java:25)
at java.lang.reflect.Method.invoke(Method.java:597)
at org.codehaus.plexus.classworlds.launcher.Launcher.launchEnhanced(Launcher.java:290)
at org.codehaus.plexus.classworlds.launcher.Launcher.launch(Launcher.java:230)
at org.codehaus.plexus.classworlds.launcher.Launcher.mainWithExitCode(Launcher.java:409)
at org.codehaus.plexus.classworlds.launcher.Launcher.main(Launcher.java:352)
[ERROR]
[ERROR] Re-run Maven using the -X switch to enable full debug logging.
[ERROR]
[ERROR] For more information about the errors and possible solutions, please read the following articles:
[ERROR] [Help 1] http://cwiki.apache.org/confluence/display/MAVEN/MissingProjectException


Looks like a Maven setting problem, but I'm not expert on Maven, so ...

Any help would be appreciated.
Thank you,
Mark
andreeeas (2) [Avatar] Offline
#2
Re: newbie install problem